BDBM50437726 CHEMBL2409369
SMILES Cn1ccc(cc1=O)C(=O)C1CCN(CC1)[C@@H]1Cc2ccccc2C[C@H]1O
InChI Key InChIKey=VUEQNSGUZRWOMA-WOJBJXKFSA-N
Data  2 KI
  Tab Delimited (TSV)   2D SDfile   Computed 3D by Vconf -m prep SDfile
Find this compound or compounds like it in BindingDB:
Activity Spreadsheet -- Enzyme Inhibition Constant Data from BindingDB
Found 2 hits for monomerid = 50437726
TargetVesicular acetylcholine transporter(Homo sapiens (Human))
Washington University
Curated by ChEMBL
LigandPNGBDBM50437726(CHEMBL2409369)
Affinity DataKi:  66nM. Assay description: Displacement of (-)-[3H]vesamicol from human VAChT expressed in rat PC12 cell membrane after 20 hrs
In DepthDetails ArticlePubMed
TargetSigma non-opioid intracellular receptor 1(Cavia porcellus (Guinea pig))
Washington University
Curated by ChEMBL
LigandPNGBDBM50437726(CHEMBL2409369)
Affinity DataKi:  3.35E+3nM. Assay description: Displacement of (+)- [3H]pentazocine from sigma 1 receptor expressed in guinea pig brain membrane homogenates by scintillation counting analysis
In DepthDetails ArticlePubMed