BDBM50437882 CHEMBL2407952
SMILES Cc1cc(ccn1)C(CC(c1ccc(cc1)C(O)=O)c1ccccc1C)N=O
InChI Key InChIKey=GMZJHGZSQIVJEK-UHFFFAOYSA-N
Data  1 IC50  2 EC50
  Tab Delimited (TSV)   2D SDfile   Computed 3D by Vconf -m prep SDfile
Find this compound or compounds like it in BindingDB:
Activity Spreadsheet -- Enzyme Inhibition Constant Data from BindingDB
Found 3 hits for monomerid = 50437882
TargetG-protein coupled bile acid receptor 1(Mus musculus)
F. Hoffmann-La Roche
Curated by ChEMBL
LigandPNGBDBM50437882(CHEMBL2407952)
Affinity DataEC50:  3.70E+3nM. Assay description: Agonist activity at recombinant mouse GPBAR1 expressed in CHO cells
In DepthDetails ArticlePubMed
TargetCytochrome P450 3A4(Homo sapiens (Human))
F. Hoffmann-La Roche
Curated by ChEMBL
LigandPNGBDBM50437882(CHEMBL2407952)
Affinity DataIC50: >5.00E+4nM. Assay description: Inhibition of CYP3A4 in human liver microsomes using midazolam as substrate
In DepthDetails ArticlePubMed
TargetG-protein coupled bile acid receptor 1(Homo sapiens (Human))
F. Hoffmann-La Roche
Curated by ChEMBL
LigandPNGBDBM50437882(CHEMBL2407952)
Affinity DataEC50:  260nM. Assay description: Agonist activity at recombinant human GPBAR1 expressed in CHO cells
In DepthDetails ArticlePubMed