BDBM50437883 CHEMBL2407951
SMILES Cc1ccccc1C(CC(N=O)c1ccc(=O)n(C)c1)c1ccc(Br)cc1
InChI Key InChIKey=JCNNMOCPEWZLCZ-UHFFFAOYSA-N
Data  1 IC50  3 EC50
  Tab Delimited (TSV)   2D SDfile   Computed 3D by Vconf -m prep SDfile
Find this compound or compounds like it in BindingDB:
Activity Spreadsheet -- Enzyme Inhibition Constant Data from BindingDB
Found 4 hits for monomerid = 50437883
TargetG-protein coupled bile acid receptor 1(Mus musculus)
F. Hoffmann-La Roche
Curated by ChEMBL
LigandPNGBDBM50437883(CHEMBL2407951)
Affinity DataEC50:  1.42E+3nM. Assay description: Agonist activity at recombinant mouse GPBAR1 expressed in CHO cells
In DepthDetails ArticlePubMed
TargetG-protein coupled bile acid receptor 1(Homo sapiens (Human))
F. Hoffmann-La Roche
Curated by ChEMBL
LigandPNGBDBM50437883(CHEMBL2407951)
Affinity DataEC50:  170nM. Assay description: Agonist activity at GPBAR1 in human NCI-H716 cells assessed as stimulation of cAMP production
In DepthDetails ArticlePubMed
TargetCytochrome P450 3A4(Homo sapiens (Human))
F. Hoffmann-La Roche
Curated by ChEMBL
LigandPNGBDBM50437883(CHEMBL2407951)
Affinity DataIC50: >5.00E+4nM. Assay description: Inhibition of CYP3A4 in human liver microsomes using midazolam as substrate
In DepthDetails ArticlePubMed
TargetG-protein coupled bile acid receptor 1(Homo sapiens (Human))
F. Hoffmann-La Roche
Curated by ChEMBL
LigandPNGBDBM50437883(CHEMBL2407951)
Affinity DataEC50:  8nM. Assay description: Agonist activity at recombinant human GPBAR1 expressed in CHO cells
In DepthDetails ArticlePubMed