BDBM50437889 CHEMBL2407944
SMILES CN(C)c1ccc(cc1)C(CC(N=O)c1ccncc1)c1ccccc1C
InChI Key InChIKey=PJPNDEXWHMPNBM-UHFFFAOYSA-N
Data  3 EC50
  Tab Delimited (TSV)   2D SDfile   Computed 3D by Vconf -m prep SDfile
Find this compound or compounds like it in BindingDB:
Activity Spreadsheet -- Enzyme Inhibition Constant Data from BindingDB
Found 3 hits for monomerid = 50437889
TargetG-protein coupled bile acid receptor 1(Mus musculus)
F. Hoffmann-La Roche
Curated by ChEMBL
LigandPNGBDBM50437889(CHEMBL2407944)
Affinity DataEC50:  700nM. Assay description: Agonist activity at recombinant mouse GPBAR1 expressed in CHO cells
In DepthDetails ArticlePubMed
TargetG-protein coupled bile acid receptor 1(Homo sapiens (Human))
F. Hoffmann-La Roche
Curated by ChEMBL
LigandPNGBDBM50437889(CHEMBL2407944)
Affinity DataEC50:  1.04E+3nM. Assay description: Agonist activity at GPBAR1 in human NCI-H716 cells assessed as stimulation of cAMP production
In DepthDetails ArticlePubMed
TargetG-protein coupled bile acid receptor 1(Homo sapiens (Human))
F. Hoffmann-La Roche
Curated by ChEMBL
LigandPNGBDBM50437889(CHEMBL2407944)
Affinity DataEC50:  25nM. Assay description: Agonist activity at recombinant human GPBAR1 expressed in CHO cells
In DepthDetails ArticlePubMed