BDBM50437896 CHEMBL2407939
SMILES CO\N=C(/CC(c1ccccc1)c1ccc(cc1)N(C)C)c1ccncc1
InChI Key InChIKey=IBXDHALIIXNLKO-WJTDDFOZSA-N
Data  1 EC50
  Tab Delimited (TSV)   2D SDfile   Computed 3D by Vconf -m prep SDfile
Find this compound or compounds like it in BindingDB:
Activity Spreadsheet -- Enzyme Inhibition Constant Data from BindingDB
Found 1 hit for monomerid = 50437896
TargetG-protein coupled bile acid receptor 1(Homo sapiens (Human))
F. Hoffmann-La Roche
Curated by ChEMBL
LigandPNGBDBM50437896(CHEMBL2407939)
Affinity DataEC50: >1.00E+4nM. Assay description: Agonist activity at recombinant human GPBAR1 expressed in CHO cells
In DepthDetails ArticlePubMed