BDBM50438540 CHEMBL2414859
SMILES COc1ccc(C=NNC(=O)Nc2ccncc2)cc1
InChI Key InChIKey=ZZYHSQUEYLZWSM-UHFFFAOYSA-N
Data  2 KI  2 IC50
  Tab Delimited (TSV)   2D SDfile   Computed 3D by Vconf -m prep SDfile
Find this compound or compounds like it in BindingDB:
Activity Spreadsheet -- Enzyme Inhibition Constant Data from BindingDB
Found 4 hits for monomerid = 50438540
TargetAcetylcholinesterase(Electrophorus electricus (Electric eel))
Banaras Hindu University
Curated by ChEMBL
LigandPNGBDBM50438540(CHEMBL2414859)
Affinity DataKi:  3.55E+4nM. Assay description: Competitive inhibition of electric eel AChE using acetylthiocholine iodide as substrate by Lineweaver-Burk plot analysis
In DepthDetails ArticlePubMed
TargetCholinesterase(Homo sapiens (Human))
Banaras Hindu University
Curated by ChEMBL
LigandPNGBDBM50438540(CHEMBL2414859)
Affinity DataKi:  6.24E+5nM. Assay description: Competitive inhibition of human serum BChE using butyrylthiocholine iodide as substrate by Lineweaver-Burk plot analysis
In DepthDetails ArticlePubMed
TargetAcetylcholinesterase(Electrophorus electricus (Electric eel))
Banaras Hindu University
Curated by ChEMBL
LigandPNGBDBM50438540(CHEMBL2414859)
Affinity DataIC50:  4.90E+4nM. Assay description: Inhibition of electric eel AChE using acetylthiocholine iodide as substrate preincubated for 20 mins prior to substrate addition by Ellman's method
In DepthDetails ArticlePubMed
TargetCholinesterase(Homo sapiens (Human))
Banaras Hindu University
Curated by ChEMBL
LigandPNGBDBM50438540(CHEMBL2414859)
Affinity DataIC50:  7.87E+5nM. Assay description: Inhibition of human serum BChE using butyrylthiocholine iodide as substrate preincubated for 20 mins prior to substrate addition by Ellman's method
In DepthDetails ArticlePubMed