BDBM50441048 CHEMBL2430170
SMILES Cc1cc(CC(NC(=O)N2CCC(CC2)N2Cc3ccccc3NC2=O)c2nccn2Cc2cccnc2)cc2cn[nH]c12
InChI Key InChIKey=NMJMMGJSYZAVQK-UHFFFAOYSA-N
Data  1 IC50
  Tab Delimited (TSV)   2D SDfile   Computed 3D by Vconf -m prep SDfile
Find this compound or compounds like it in BindingDB:
Activity Spreadsheet -- Enzyme Inhibition Constant Data from BindingDB
Found 1 hit for monomerid = 50441048
TargetCalcitonin gene-related peptide type 1 receptor(Homo sapiens (Human))
Bristol-Myers Squibb
Curated by ChEMBL
LigandPNGBDBM50441048(CHEMBL2430170)
Affinity DataIC50:  0.420nM. Assay description: Antagonist activity at human CGRP receptor expressed in human SK-N-MC cells assessed as inhibition of CGRP-stimulated cAMP production
In DepthDetails ArticlePubMed