BDBM50443629 CHEMBL3092467::US9174993, 16::US9221828, 16
SMILES COc1ccc(Cl)c(c1)S(=O)(=O)Nc1ccc(cc1)-c1cnc2c(C)n[nH]c2n1
InChI Key InChIKey=LQOIAHRPEWFITJ-UHFFFAOYSA-N
Data  8 IC50
  Tab Delimited (TSV)   2D SDfile   Computed 3D by Vconf -m prep SDfile
Find this compound or compounds like it in BindingDB:
Activity Spreadsheet -- Enzyme Inhibition Constant Data from BindingDB
Found 8 hits for monomerid = 50443629
TargetSerine/threonine-protein kinase Sgk1(Homo sapiens (Human))
Sanofi
US Patent
LigandPNGBDBM50443629(CHEMBL3092467 | US9174993, 16 | US9221828, 16)
Affinity DataIC50:  2nM. Assay description: The compounds were tested for serum and glucocorticoid-regulated kinase 1 (SGK-1) inhibitory activity in a substrate phosphorylation assay designed t...
In DepthDetails US Patent
TargetSerine/threonine-protein kinase Sgk1(Homo sapiens (Human))
Sanofi
US Patent
LigandPNGBDBM50443629(CHEMBL3092467 | US9174993, 16 | US9221828, 16)
Affinity DataIC50:  2nMpH: 7.4 T: 2°C. Assay description: The enzyme reaction was carried out in a buffer containing 25 mM Tris-HCl (pH 7.4), 5 mM MgCl2, 2 mM MnCl2, 2 mM DTT, and 0.03% bovine serum albumi...
In DepthDetails US Patent
TargetSerine/threonine-protein kinase Sgk1(Homo sapiens (Human))
Sanofi
US Patent
LigandPNGBDBM50443629(CHEMBL3092467 | US9174993, 16 | US9221828, 16)
Affinity DataIC50:  34nM. Assay description: Inhibition of human SGK1 using fluo-5(6)-carboxyfluorescein)-RPRAATF-NH2 fluorescently labeled peptide by substrate phosphorylation assay in presence...
In DepthDetails ArticlePubMed
TargetSerine/threonine-protein kinase Sgk1(Homo sapiens (Human))
Sanofi
US Patent
LigandPNGBDBM50443629(CHEMBL3092467 | US9174993, 16 | US9221828, 16)
Affinity DataIC50:  2nM. Assay description: Inhibition of recombinant human SGK-1 expressed in baculovirus expression system using (5(6)-carboxyfluorescein)-RPRAATF-NH2 as substrate preincubate...
In DepthDetails ArticlePubMed
TargetCytochrome P450 3A4(Homo sapiens (Human))
Sanofi R & D
Curated by ChEMBL
LigandPNGBDBM50443629(CHEMBL3092467 | US9174993, 16 | US9221828, 16)
Affinity DataIC50:  1.86E+4nM. Assay description: Inhibition of human CYP3A4 testosterone site in human liver microsomes using midazolam as substrate by LC-MS/MS analysis
In DepthDetails ArticlePubMed
TargetSerine/threonine-protein kinase Sgk1(Homo sapiens (Human))
Sanofi
US Patent
LigandPNGBDBM50443629(CHEMBL3092467 | US9174993, 16 | US9221828, 16)
Affinity DataIC50:  2nM. Assay description: Inhibition of human SGK1 using fluo-5(6)-carboxyfluorescein)-RPRAATF-NH2 fluorescently labeled peptide by substrate phosphorylation assay in presence...
In DepthDetails ArticlePubMed
TargetSerine/threonine-protein kinase Sgk1(Homo sapiens (Human))
Sanofi
US Patent
LigandPNGBDBM50443629(CHEMBL3092467 | US9174993, 16 | US9221828, 16)
Affinity DataIC50:  1.50E+3nM. Assay description: Inhibition of recombinant human SGK1 (S61 to L431, S422D) expressed in human U20S cells assessed as inhibition of GSK3beta phosphorylation after 6 hr...
In DepthDetails ArticlePubMed
TargetCytochrome P450 3A4(Homo sapiens (Human))
Sanofi R & D
Curated by ChEMBL
LigandPNGBDBM50443629(CHEMBL3092467 | US9174993, 16 | US9221828, 16)
Affinity DataIC50:  2.68E+4nM. Assay description: Inhibition of human CYP3A4 midazolam site in human liver microsomes using midazolam as substrate by LC-MS/MS analysis
In DepthDetails ArticlePubMed