BDBM50444339 CHEMBL3094385
SMILES OC(c1ccc(cc1)N(CC(F)(F)F)C(=O)c1ccccc1)(C(F)(F)F)C(F)(F)F
InChI Key InChIKey=PQPGONXNPLRKQD-UHFFFAOYSA-N
Data  1 IC50  1 EC50
  Tab Delimited (TSV)   2D SDfile   Computed 3D by Vconf -m prep SDfile
Find this compound or compounds like it in BindingDB:
Activity Spreadsheet -- Enzyme Inhibition Constant Data from BindingDB
Found 2 hits for monomerid = 50444339
TargetNuclear receptor ROR-gamma(Homo sapiens (Human))
Genentech
Curated by ChEMBL
LigandPNGBDBM50444339(CHEMBL3094385)
Affinity DataIC50:  2.00E+3nM. Assay description: Displacement of [3H2]-25-hydroxycholesterol from N-terminal 6xHis-tagged human RORc ligand binding domain (241 to 486) expressed in bacterial express...
In DepthDetails ArticlePubMed
TargetNuclear receptor ROR-gamma(Homo sapiens (Human))
Genentech
Curated by ChEMBL
LigandPNGBDBM50444339(CHEMBL3094385)
Affinity DataEC50:  4.00E+3nM. Assay description: Inverse agonist activity at N-terminal 6xHis-tagged human RORc ligand binding domain (241 to 486) expressed in bacterial expression system assessed a...
In DepthDetails ArticlePubMed