BDBM50444577 CHEMBL3099711
SMILES CC(F)(F)c1cccc(n1)-c1nnc[nH]1
InChI Key InChIKey=VCLPSRPTVOZUSG-UHFFFAOYSA-N
Data  1 IC50
  Tab Delimited (TSV)   2D SDfile   Computed 3D by Vconf -m prep SDfile
Find this compound or compounds like it in BindingDB:
Activity Spreadsheet -- Enzyme Inhibition Constant Data from BindingDB
Found 1 hit for monomerid = 50444577
TargetDNA ligase(Staphylococcus aureus)
Astex Pharmaceuticals
Curated by ChEMBL
LigandPNGBDBM50444577(CHEMBL3099711)
Affinity DataIC50:  2.10E+4nM. Assay description: Inhibition of C-terminal 6xHis-tagged full length recombinant Staphylococcus aureus DNA ligase (1 to 312) expressed in Escherichia coli BL21 (DE3) us...
In DepthDetails ArticlePubMed