BDBM50445049 CHEMBL3098758
SMILES Cc1cccc(NC(=O)c2ccc(Br)cc2C(O)=O)c1
InChI Key InChIKey=JHTIKNRRWRFZAF-UHFFFAOYSA-N
Data  1 IC50
  Tab Delimited (TSV)   2D SDfile   Computed 3D by Vconf -m prep SDfile
Find this compound or compounds like it in BindingDB:
Activity Spreadsheet -- Enzyme Inhibition Constant Data from BindingDB
Found 1 hit for monomerid = 50445049
TargetSortilin(Homo sapiens (Human))
H. Lundbeck
Curated by ChEMBL
LigandPNGBDBM50445049(CHEMBL3098758)
Affinity DataIC50:  5.20E+3nM. Assay description: Displacement of [3H]-neurotensin from sortilin (unknown origin) incubated 30 mins prior to [3H]-neurotensin addition measured after 6 hrs by scintill...
In DepthDetails ArticlePubMed