BDBM50445223 CHEMBL3105208
SMILES Fc1ccc(cc1F)C(=O)N1CCN2C(=O)c3ccccc3C12c1ccccc1
InChI Key InChIKey=RDSYLVNSMMDBBS-UHFFFAOYSA-N
Data  2 IC50
  Tab Delimited (TSV)   2D SDfile   Computed 3D by Vconf -m prep SDfile
Find this compound or compounds like it in BindingDB:
Activity Spreadsheet -- Enzyme Inhibition Constant Data from BindingDB
Found 2 hits for monomerid = 50445223
TargetMuscarinic acetylcholine receptor M5(RAT)
Vanderbilt University
Curated by ChEMBL
LigandPNGBDBM50445223(CHEMBL3105208)
Affinity DataIC50:  2.10E+3nM. Assay description: Negative allosteric modulation of rat muscarinic acetylcholine receptor M5 expressed in CHO cells assessed as inhibition of acetylcholine-induced cal...
In DepthDetails ArticlePubMed
TargetMuscarinic acetylcholine receptor M4(RAT)
Vanderbilt University
Curated by ChEMBL
LigandPNGBDBM50445223(CHEMBL3105208)
Affinity DataIC50: >3.00E+4nM. Assay description: Negative allosteric modulation of rat muscarinic acetylcholine receptor M4 expressed in CHO cells assessed as inhibition of acetylcholine-induced cal...
In DepthDetails ArticlePubMed