BDBM50445224 CHEMBL3105213
SMILES Fc1ccc(cc1F)C(=O)N1CCN2C(=O)c3ccccc3C12c1ccc(Cl)cc1
InChI Key InChIKey=GXBAKXRLQAPKEE-UHFFFAOYSA-N
Data  3 IC50
  Tab Delimited (TSV)   2D SDfile   Computed 3D by Vconf -m prep SDfile
Find this compound or compounds like it in BindingDB:
Activity Spreadsheet -- Enzyme Inhibition Constant Data from BindingDB
Found 3 hits for monomerid = 50445224
TargetMuscarinic acetylcholine receptor M5(Homo sapiens (Human))
Vanderbilt University Medical Center
Curated by ChEMBL
LigandPNGBDBM50445224(CHEMBL3105213)
Affinity DataIC50:  479nM. Assay description: Negative allosteric modulation of human muscarinic acetylcholine receptor M5 expressed in CHO cells assessed as inhibition of acetylcholine-induced c...
In DepthDetails ArticlePubMed
TargetMuscarinic acetylcholine receptor M5(RAT)
Vanderbilt University
Curated by ChEMBL
LigandPNGBDBM50445224(CHEMBL3105213)
Affinity DataIC50:  1.10E+3nM. Assay description: Negative allosteric modulation of rat muscarinic acetylcholine receptor M5 expressed in CHO cells assessed as inhibition of acetylcholine-induced cal...
In DepthDetails ArticlePubMed
TargetMuscarinic acetylcholine receptor M5(Homo sapiens (Human))
Vanderbilt University Medical Center
Curated by ChEMBL
LigandPNGBDBM50445224(CHEMBL3105213)
Affinity DataIC50:  480nM. Assay description: Negative allosteric modulation of human muscarinic acetylcholine receptor M5 expressed in CHO cells assessed as inhibition of acetylcholine-induced c...
In DepthDetails ArticlePubMed