BDBM50445258 CHEMBL3103897
SMILES O=C1NC(=S)N\C1=C\c1cc2ccc(cc2[nH]1)-c1ccc2C(=O)NCc2c1
InChI Key InChIKey=QSJQKEAAANSWDW-CAOOACKPSA-N
Data  1 IC50
  Tab Delimited (TSV)   2D SDfile   Computed 3D by Vconf -m prep SDfile
Find this compound or compounds like it in BindingDB:
Activity Spreadsheet -- Enzyme Inhibition Constant Data from BindingDB
Found 1 hit for monomerid = 50445258
TargetPerforin-1(Homo sapiens (Human))
University Of Auckland
Curated by ChEMBL
LigandPNGBDBM50445258(CHEMBL3103897)
Affinity DataIC50:  1.58E+3nM. Assay description: Inhibition of recombinant perforin (unknown origin)-mediated lysis of human [51Cr]-labelled Jurkat cells assessed as release of [51Cr] preincubated f...
In DepthDetails ArticlePubMed