BDBM50445819 CHEMBL3104785
SMILES CCCN(C1CCN(CCC(C)(C(=O)N[C@@H](CO)c2ccc(F)cc2)c2ccc(Cl)c(Cl)c2)CC1)C(C)=O
InChI Key InChIKey=HGOGUZYKZRGMAO-BVOOQYFDSA-N
Data  2 KI
  Tab Delimited (TSV)   2D SDfile   Computed 3D by Vconf -m prep SDfile
Find this compound or compounds like it in BindingDB:
Activity Spreadsheet -- Enzyme Inhibition Constant Data from BindingDB
Found 2 hits for monomerid = 50445819
TargetNeuromedin-K receptor(Homo sapiens (Human))
Universit£
Curated by ChEMBL
LigandPNGBDBM50445819(CHEMBL3104785)
Affinity DataKi:  0.501nM. Assay description: Displacement of [3H]-SR142801 from human NK3 receptor expressed in recombinant CHO cells
In DepthDetails ArticlePubMed
TargetNeuromedin-K receptor(Homo sapiens (Human))
Universit£
Curated by ChEMBL
LigandPNGBDBM50445819(CHEMBL3104785)
Affinity DataKi:  5.01E+3nM. Assay description: Binding affinity to NK3 receptor (unknown origin)
In DepthDetails ArticlePubMed