BDBM50445978 CHEMBL3103089
SMILES Cc1ccc(cc1)C(=O)N=Nc1c2ccccc2c2nc3ccccc3[nH]c12
InChI Key InChIKey=HPYOIIWKVJDSGZ-UHFFFAOYSA-N
Data  1 IC50
  Tab Delimited (TSV)   2D SDfile   Computed 3D by Vconf -m prep SDfile
Find this compound or compounds like it in BindingDB:
Activity Spreadsheet -- Enzyme Inhibition Constant Data from BindingDB
Found 1 hit for monomerid = 50445978
TargetOligo-1,6-glucosidase IMA1(Saccharomyces cerevisiae S288c (Baker's yeast))
University Of The Punjab
Curated by ChEMBL
LigandPNGBDBM50445978(CHEMBL3103089)
Affinity DataIC50: >5.00E+5nM. Assay description: Inhibition of Saccharomyces cerevisiae alpha-glucosidase using p-nitrophenyl-alpha-D-glucopyranoside as substrate preincubated for 10 mins measured a...
In DepthDetails ArticlePubMed