BDBM50447023 CHEMBL1973869
SMILES [O-][N+](=O)c1ccc2n(Cc3ccccc3)nc(OCc3ccccc3)c2c1
InChI Key InChIKey=RUJMERFUMDLBHZ-UHFFFAOYSA-N
Data  2 KI  1 IC50
  Tab Delimited (TSV)   2D SDfile   Computed 3D by Vconf -m prep SDfile
Find this compound or compounds like it in BindingDB:
Activity Spreadsheet -- Enzyme Inhibition Constant Data from BindingDB
Found 3 hits for monomerid = 50447023
TargetCannabinoid receptor 2(Homo sapiens (Human))
Instituto De Qu£Mica M£Dica (Csic)
Curated by ChEMBL
LigandPNGBDBM50447023(CHEMBL1973869)
Affinity DataKi:  400nM. Assay description: Displacement of [3H]CP55940 from human CB2R transfected in HEK293EBNA cell membrane incubated for 90 mins by Microbeta TriLux based luminescence anal...
In DepthDetails ArticlePubMed
TargetCannabinoid receptor 1(Homo sapiens (Human))
Instituto De Qu£Mica M£Dica (Csic)
Curated by ChEMBL
LigandPNGBDBM50447023(CHEMBL1973869)
Affinity DataKi:  1.20E+3nM. Assay description: Displacement of [3H]CP55940 from human CB1R transfected in HEK293EBNA cell membranes incubated for 90 mins by Microbeta TriLux based luminescence ana...
In DepthDetails ArticlePubMed
TargetCholinesterase(Equus caballus (Horse))
Instituto De Qu£Mica M£Dica (Csic)
Curated by ChEMBL
LigandPNGBDBM50447023(CHEMBL1973869)
Affinity DataIC50: >1.00E+4nM. Assay description: Inhibition of horse serum BuChE using butyrylthiocholine as substrate by Ellman's method
In DepthDetails ArticlePubMed