BDBM50447531 CHEMBL3116094
SMILES CC(C)(O)C(Br)COc1c2OCOc2cc2oc(=O)ccc12
InChI Key InChIKey=XQRCXKRJRCOCHG-UHFFFAOYSA-N
Data  1 IC50
  Tab Delimited (TSV)   2D SDfile   Computed 3D by Vconf -m prep SDfile
Find this compound or compounds like it in BindingDB:
Activity Spreadsheet -- Enzyme Inhibition Constant Data from BindingDB
Found 1 hit for monomerid = 50447531
TargetDNA polymerase I, thermostable(Thermus aquaticus)
Intequi-Conicet
Curated by ChEMBL
LigandPNGBDBM50447531(CHEMBL3116094)
Affinity DataIC50:  5.79E+4nM. Assay description: Inhibition of Thermus aquaticus taq DNA polymerase by PCR analysis
In DepthDetails ArticlePubMed