BDBM50447678 CHEMBL3112774
SMILES Clc1ccc(Oc2cccc(CN3CC4(C3)CN(C4)C(=O)Nc3cccnc3)c2)cc1
InChI Key InChIKey=JQIWHNRTCHCRJK-UHFFFAOYSA-N
Data  2 IC50
  Tab Delimited (TSV)   2D SDfile   Computed 3D by Vconf -m prep SDfile
Find this compound or compounds like it in BindingDB:
Activity Spreadsheet -- Enzyme Inhibition Constant Data from BindingDB
Found 2 hits for monomerid = 50447678
TargetFatty-acid amide hydrolase 1(Homo sapiens (Human))
Janssen Research And Development
Curated by ChEMBL
LigandPNGBDBM50447678(CHEMBL3112774)
Affinity DataIC50:  125nM. Assay description: Inhibition of human FAAH after 60 mins
In DepthDetails ArticlePubMed
TargetFatty-acid amide hydrolase 1 [30-579](Rattus norvegicus (rat))
Janssen Research And Development
Curated by ChEMBL
LigandPNGBDBM50447678(CHEMBL3112774)
Affinity DataIC50:  1.37E+3nM. Assay description: Inhibition of rat FAAH after 60 mins
In DepthDetails ArticlePubMed