BDBM50447713 CHEMBL3113207
SMILES COc1cc(cc(Oc2ccc3CCCN(c3c2)S(=O)(=O)c2ccc(Cl)cc2)n1)-c1nc(no1)C1CC1
InChI Key InChIKey=WLIICSHMSPPQIE-UHFFFAOYSA-N
Data  1 EC50
  Tab Delimited (TSV)   2D SDfile   Computed 3D by Vconf -m prep SDfile
Find this compound or compounds like it in BindingDB:
Activity Spreadsheet -- Enzyme Inhibition Constant Data from BindingDB
Found 1 hit for monomerid = 50447713
TargetGlucose-dependent insulinotropic receptor(Homo sapiens (Human))
Amgen
Curated by ChEMBL
LigandPNGBDBM50447713(CHEMBL3113207)
Affinity DataEC50:  270nM. Assay description: Agonist activity at human GPR119 expressed in HEK293 cells assessed as cAMP accumulation after 30 mins
In DepthDetails ArticlePubMed