BDBM50447721 CHEMBL3112981
SMILES FC(F)(F)c1noc(n1)-c1cc(Cl)nc(Oc2ccc3CCCN(c3c2)S(=O)(=O)c2ccc(Cl)cc2)c1
InChI Key InChIKey=FWMVVPCOCXWLQG-UHFFFAOYSA-N
Data  1 EC50
  Tab Delimited (TSV)   2D SDfile   Computed 3D by Vconf -m prep SDfile
Find this compound or compounds like it in BindingDB:
Activity Spreadsheet -- Enzyme Inhibition Constant Data from BindingDB
Found 1 hit for monomerid = 50447721
TargetGlucose-dependent insulinotropic receptor(Homo sapiens (Human))
Amgen
Curated by ChEMBL
LigandPNGBDBM50447721(CHEMBL3112981)
Affinity DataEC50:  110nM. Assay description: Agonist activity at human GPR119 expressed in HEK293 cells assessed as cAMP accumulation after 30 mins
In DepthDetails ArticlePubMed