BDBM50448757 CHEMBL3128025::US8835445, 18
SMILES Cc1cc2nc(-c3cccs3)n(-c3ccc4c(N)nc(N)nc4c3)c2cc1C
InChI Key InChIKey=SVQAULWAXASJJB-UHFFFAOYSA-N
Data  4 KI
  Tab Delimited (TSV)   2D SDfile   Computed 3D by Vconf -m prep SDfile
Find this compound or compounds like it in BindingDB:
Activity Spreadsheet -- Enzyme Inhibition Constant Data from BindingDB
Found 4 hits for monomerid = 50448757
TargetDihydrofolate reductase(Staphylococcus aureus)
Trius Therapeutics
US Patent
LigandPNGBDBM50448757(CHEMBL3128025 | US8835445, 18)
Affinity DataKi:  0.00500nM. Assay description: Antibacterial activity as measured by the minimal inhibitory concentrations (MIC) and minimal bactericidal concentrations of compounds are well known...
In DepthDetails US Patent
TargetDihydrofolate reductase(Staphylococcus aureus)
Trius Therapeutics
US Patent
LigandPNGBDBM50448757(CHEMBL3128025 | US8835445, 18)
Affinity DataKi:  0.00500nM. Assay description: Inhibition of Staphylococcus aureus DHFR using dihydrofolate as substrate preincubated for 10 mins followed by substrate addition by spectrophotometr...
In DepthDetails ArticlePubMed
TargetDihydrofolate reductase(Homo sapiens (Human))
Trius Therapeutics
Curated by ChEMBL
LigandPNGBDBM50448757(CHEMBL3128025 | US8835445, 18)
Affinity DataKi:  1.03E+3nM. Assay description: Inhibition of human DHFR using dihydrofolate as substrate preincubated for 10 mins followed by substrate addition by spectrophotometric analysis in p...
In DepthDetails ArticlePubMed
TargetDihydrofolate reductase(Homo sapiens (Human))
Trius Therapeutics
Curated by ChEMBL
LigandPNGBDBM50448757(CHEMBL3128025 | US8835445, 18)
Affinity DataKi:  1.03E+3nM. Assay description: Antibacterial activity as measured by the minimal inhibitory concentrations (MIC) and minimal bactericidal concentrations of compounds are well known...
In DepthDetails US Patent