BDBM50450471 CHEMBL4163083
SMILES Cc1ccc(cc1)C(=O)c1ccc(O)c2ncccc12
InChI Key InChIKey=YTDGKJSTDXWUTM-UHFFFAOYSA-N
Data  1 IC50
  Tab Delimited (TSV)   2D SDfile   Computed 3D by Vconf -m prep SDfile
Find this compound or compounds like it in BindingDB:
Activity Spreadsheet -- Enzyme Inhibition Constant Data from BindingDB
Found 1 hit for monomerid = 50450471
TargetLanosterol synthase(Rattus norvegicus)
Lieber Institute For Brain Development
Curated by ChEMBL
LigandPNGBDBM50450471(CHEMBL4163083)
Affinity DataIC50:  3.98E+3nM. Assay description: Inhibition of c-terminal hexa-His tagged human MB-COMT expressed in HEK293 cell membrane homogenate using norepinephrine as substrate after 1 hr in p...
Ligand InfoPC cidPC sid
In DepthDetails ArticlePubMed