BDBM50450642 CHEMBL4176252
SMILES CCOC(=O)C[C@H]1Cc2ccccc2C2(CC[C@@H](CC2)NCc2ccc(C)cc2C)O1
InChI Key InChIKey=JRRTZJFVPFHUFV-OPMJYIBYSA-N
Data  2 KI
  Tab Delimited (TSV)   2D SDfile   Computed 3D by Vconf -m prep SDfile
Find this compound or compounds like it in BindingDB:
Activity Spreadsheet -- Enzyme Inhibition Constant Data from BindingDB
Found 2 hits for monomerid = 50450642
TargetSigma intracellular receptor 2(Rattus norvegicus (Rat))
Universit£T M£Nster
Curated by ChEMBL
LigandPNGBDBM50450642(CHEMBL4176252)
Affinity DataKi:  159nM. Assay description: Displacement of [3H]-di-o-tolylguanidine from sigma2 receptor in rat liver membranes incubated for 120 mins by scintillation counting method
Ligand InfoPC cidPC sid
In DepthDetails ArticlePubMed
TargetSigma non-opioid intracellular receptor 1(Cavia porcellus (Guinea pig))
Universit£T M£Nster
Curated by ChEMBL
LigandPNGBDBM50450642(CHEMBL4176252)
Affinity DataKi:  547nM. Assay description: Displacement of [3H]-(+)-pentazocine from sigma1 receptor in guinea pig brain cortex membranes incubated for 120 mins by scintillation counting metho...
Ligand InfoPC cidPC sid
In DepthDetails ArticlePubMed