BDBM50451344 CHEMBL2303835
SMILES CS(=O)(=O)c1ccc(cc1)-c1cc(Cl)cnc1-c1ccc(CO[C@@H]2O[C@H]([C@@H](O)[C@H](O)[C@@H]2O)C(O)=O)nc1
InChI Key InChIKey=UJWKCNOGFMSHNK-VZGLXOSZSA-N
Data  2 IC50
  Tab Delimited (TSV)   2D SDfile   Computed 3D by Vconf -m prep SDfile
Find this compound or compounds like it in BindingDB:
Activity Spreadsheet -- Enzyme Inhibition Constant Data from BindingDB
Found 2 hits for monomerid = 50451344
TargetProstaglandin G/H synthase 2(Homo sapiens (Human))
Merck Frosst Centre For Therapeutic Research
Curated by ChEMBL
LigandPNGBDBM50451344(CHEMBL2303835)
Affinity DataIC50: >3.30E+4nM. Assay description: In vitro inhibition of Prostaglandin G/H synthase 2 in human whole blood assay
In DepthDetails ArticlePubMed
TargetProstaglandin G/H synthase 1(Homo sapiens (Human))
Merck Frosst Centre For Therapeutic Research
Curated by ChEMBL
LigandPNGBDBM50451344(CHEMBL2303835)
Affinity DataIC50: >1.00E+5nM. Assay description: In vitro inhibition of Prostaglandin G/H synthase 1 in human whole blood assay
In DepthDetails ArticlePubMed