BDBM50451604 CHEMBL4204677
SMILES Brc1nc2OC3(Cn2c1Br)CN1CCC3CC1
InChI Key InChIKey=MQBBQJBNXQVSMC-UHFFFAOYSA-N
Data  1 IC50  1 EC50
  Tab Delimited (TSV)   2D SDfile   Computed 3D by Vconf -m prep SDfile
Find this compound or compounds like it in BindingDB:
Activity Spreadsheet -- Enzyme Inhibition Constant Data from BindingDB
Found 2 hits for monomerid = 50451604
Target5-hydroxytryptamine receptor 3A(Homo sapiens (Human))
Bristol-Myers Squibb Pharmaceutical Research Institute
Curated by ChEMBL
LigandPNGBDBM50451604(CHEMBL4204677)
Affinity DataIC50:  62nM. Assay description: Antagonist activity at human 5-HT3A receptor expressed in HEK293 cells assessed as inhibition of 5-HT-induced calcium flux preincubated for 30 mins p...
Ligand InfoPC cidPC sid
In DepthDetails ArticlePubMed
TargetNeuronal acetylcholine receptor subunit alpha-7(Rattus norvegicus (Rat))
Bristol-Myers Squibb Pharmaceutical Research Institute
Curated by ChEMBL
LigandPNGBDBM50451604(CHEMBL4204677)
Affinity DataEC50:  32nM. Assay description: Agonist activity at rat alpha7 nAChR expressed in HEK293 cells co-expressing human RIC-3 assessed as increase in calcium flux measured for 2 mins by ...
Ligand InfoPC cidPC sid
In DepthDetails ArticlePubMed