BDBM50451794 CHEMBL161944
SMILES CN1CCCC1c1cnc2ccccc2c1
InChI Key InChIKey=CUNLUNDTLIURBV-UHFFFAOYSA-N
Data  1 KI
  Tab Delimited (TSV)   2D SDfile   Computed 3D by Vconf -m prep SDfile
Find this compound or compounds like it in BindingDB:
Activity Spreadsheet -- Enzyme Inhibition Constant Data from BindingDB
Found 1 hit for monomerid = 50451794
TargetNeuronal acetylcholine receptor subunit alpha-4/beta-2(Rattus norvegicus (Rat))
Virginia Commonwealth University
Curated by ChEMBL
LigandPNGBDBM50451794(CHEMBL161944)
Affinity DataKi:  11nM. Assay description: Affinity at alpha4-beta2 nACh receptors in rat brain (minus cerebellum) homogenates.
In DepthDetails ArticlePubMed