BDBM50451796 CHEMBL356996
SMILES CCN1CCN=C1Cc1cccnc1
InChI Key InChIKey=QJMVVNQNTCMXJJ-UHFFFAOYSA-N
Data  1 KI
  Tab Delimited (TSV)   2D SDfile   Computed 3D by Vconf -m prep SDfile
Find this compound or compounds like it in BindingDB:
Activity Spreadsheet -- Enzyme Inhibition Constant Data from BindingDB
Found 1 hit for monomerid = 50451796
TargetNeuronal acetylcholine receptor subunit alpha-4/beta-2(Rattus norvegicus (Rat))
Virginia Commonwealth University
Curated by ChEMBL
LigandPNGBDBM50451796(CHEMBL356996)
Affinity DataKi:  150nM. Assay description: Affinity at alpha4-beta2 nACh receptors in rat brain (minus cerebellum) homogenates.
In DepthDetails ArticlePubMed