BDBM50451797 CHEMBL349250
SMILES CN1CCN=C1Cc1ccc(Br)nc1
InChI Key InChIKey=YUUCFCKMXDJCNR-UHFFFAOYSA-N
Data  1 KI
  Tab Delimited (TSV)   2D SDfile   Computed 3D by Vconf -m prep SDfile
Find this compound or compounds like it in BindingDB:
Activity Spreadsheet -- Enzyme Inhibition Constant Data from BindingDB
Found 1 hit for monomerid = 50451797
TargetNeuronal acetylcholine receptor subunit alpha-4/beta-2(Rattus norvegicus (Rat))
Virginia Commonwealth University
Curated by ChEMBL
LigandPNGBDBM50451797(CHEMBL349250)
Affinity DataKi:  7.30nM. Assay description: Affinity at alpha4-beta2 nACh receptors in rat brain (minus cerebellum) homogenates.
In DepthDetails ArticlePubMed