BDBM50451800 CHEMBL343169
SMILES C(C1=NCCN1)c1cccnc1
InChI Key InChIKey=QARDLIPNCAPWCY-UHFFFAOYSA-N
Data  1 KI
  Tab Delimited (TSV)   2D SDfile   Computed 3D by Vconf -m prep SDfile
Find this compound or compounds like it in BindingDB:
Activity Spreadsheet -- Enzyme Inhibition Constant Data from BindingDB
Found 1 hit for monomerid = 50451800
TargetNeuronal acetylcholine receptor subunit alpha-4/beta-2(Rattus norvegicus (Rat))
Virginia Commonwealth University
Curated by ChEMBL
LigandPNGBDBM50451800(CHEMBL343169)
Affinity DataKi:  325nM. Assay description: Affinity at alpha4-beta2 nACh receptors in rat brain (minus cerebellum) homogenates.
In DepthDetails ArticlePubMed