BDBM50452225 CHEMBL4203748
SMILES CC1(C)OCC(O1)c1ccc(CC(=O)Nc2ccn(Cc3ccc(F)c(F)c3)n2)cc1
InChI Key InChIKey=FQOZFYKBOBBSJQ-UHFFFAOYSA-N
Data  3 IC50
  Tab Delimited (TSV)   2D SDfile   Computed 3D by Vconf -m prep SDfile
Find this compound or compounds like it in BindingDB:
Activity Spreadsheet -- Enzyme Inhibition Constant Data from BindingDB
Found 3 hits for monomerid = 50452225
TargetVoltage-dependent T-type calcium channel subunit alpha-1H(Homo sapiens (Human))
Idorsia Pharmaceuticals
Curated by ChEMBL
LigandPNGBDBM50452225(CHEMBL4203748)
Affinity DataIC50:  10nM. Assay description: Inhibition of recombinant Cav3.2 (unknown origin) expressed in HEK293 cells assessed as decrease in calcium flux preincubated for 3 mins followed by ...
Ligand InfoPC cidPC sid
In DepthDetails ArticlePubMed
TargetVoltage-dependent T-type calcium channel subunit alpha-1G(Homo sapiens (Human))
Idorsia Pharmaceuticals
Curated by ChEMBL
LigandPNGBDBM50452225(CHEMBL4203748)
Affinity DataIC50:  3.40nM. Assay description: Inhibition of recombinant Cav3.1 (unknown origin) expressed in HEK293 cells assessed as decrease in calcium flux preincubated for 3 mins followed by ...
Ligand InfoPC cidPC sid
In DepthDetails ArticlePubMed
TargetVoltage-dependent T-type calcium channel subunit alpha-1I(Homo sapiens (Human))
Idorsia Pharmaceuticals
Curated by ChEMBL
LigandPNGBDBM50452225(CHEMBL4203748)
Affinity DataIC50:  1.80nM. Assay description: Inhibition of recombinant Cav3.3 (unknown origin) expressed in HEK293 cells assessed as decrease in calcium flux preincubated for 3 mins followed by ...
Ligand InfoPC cidPC sid
In DepthDetails ArticlePubMed