BDBM50452280 CHEMBL4212176
SMILES Cc1cc(CC(=O)Nc2ccn(Cc3ccc(cn3)C#N)n2)ccc1OC(F)(F)F
InChI Key InChIKey=GJKURPNQOJQXPQ-UHFFFAOYSA-N
Data  5 IC50
  Tab Delimited (TSV)   2D SDfile   Computed 3D by Vconf -m prep SDfile
Find this compound or compounds like it in BindingDB:
Activity Spreadsheet -- Enzyme Inhibition Constant Data from BindingDB
Found 5 hits for monomerid = 50452280
TargetVoltage-dependent T-type calcium channel subunit alpha-1I(Homo sapiens (Human))
Idorsia Pharmaceuticals
Curated by ChEMBL
LigandPNGBDBM50452280(CHEMBL4212176)
Affinity DataIC50:  2nM. Assay description: Inhibition of recombinant Cav3.3 (unknown origin) expressed in HEK293 cells assessed as decrease in calcium flux preincubated for 3 mins followed by ...
Ligand InfoPC cidPC sid
In DepthDetails ArticlePubMed
TargetCytochrome P450 3A4(Homo sapiens (Human))
Idorsia Pharmaceuticals
Curated by ChEMBL
LigandPNGBDBM50452280(CHEMBL4212176)
Affinity DataIC50:  1.70E+4nM. Assay description: Inhibition of human CYP3A4 using testosterone as substrate preincubated for 30 mins
Ligand InfoPC cidPC sid
In DepthDetails ArticlePubMed
TargetVoltage-dependent T-type calcium channel subunit alpha-1H(Homo sapiens (Human))
Idorsia Pharmaceuticals
Curated by ChEMBL
LigandPNGBDBM50452280(CHEMBL4212176)
Affinity DataIC50:  25nM. Assay description: Inhibition of recombinant Cav3.2 (unknown origin) expressed in HEK293 cells assessed as decrease in calcium flux preincubated for 3 mins followed by ...
Ligand InfoPC cidPC sid
In DepthDetails ArticlePubMed
TargetVoltage-dependent L-type calcium channel subunit alpha-1C(Homo sapiens (Human))
Idorsia Pharmaceuticals
Curated by ChEMBL
LigandPNGBDBM50452280(CHEMBL4212176)
Affinity DataIC50:  1.48E+3nM. Assay description: Inhibition of recombinant Cav1.2 (unknown origin) expressed in HEK293 cells assessed as decrease in calcium flux preincubated for 3 mins followed by ...
Ligand InfoPC cidPC sid
In DepthDetails ArticlePubMed
TargetVoltage-dependent T-type calcium channel subunit alpha-1G(Homo sapiens (Human))
Idorsia Pharmaceuticals
Curated by ChEMBL
LigandPNGBDBM50452280(CHEMBL4212176)
Affinity DataIC50:  2.30nM. Assay description: Inhibition of recombinant Cav3.1 (unknown origin) expressed in HEK293 cells assessed as decrease in calcium flux preincubated for 3 mins followed by ...
Ligand InfoPC cidPC sid
In DepthDetails ArticlePubMed