BDBM50452393 CHEMBL4212760
SMILES CC(C)[C@@H]1N=C(c2ccccc2F)c2cc(Cl)ccc2NC1=S
InChI Key InChIKey=IIYOCBNZOLLZCM-INIZCTEOSA-N
Data  4 EC50
  Tab Delimited (TSV)   2D SDfile   Computed 3D by Vconf -m prep SDfile
Find this compound or compounds like it in BindingDB:
Activity Spreadsheet -- Enzyme Inhibition Constant Data from BindingDB
Found 4 hits for monomerid = 50452393
TargetMuscarinic acetylcholine receptor M1(Homo sapiens (Human))
Roche Pharma Research And Early Development
Curated by ChEMBL
LigandPNGBDBM50452393(CHEMBL4212760)
Affinity DataEC50:  80nM. Assay description: Positive allosteric modulation of human wild type M1 receptor assessed as increase in acetylcholine-induced calcium flux by FLIPR assay
Ligand InfoPC cidPC sid
In DepthDetails ArticlePubMed
TargetMuscarinic acetylcholine receptor M1(Homo sapiens (Human))
Roche Pharma Research And Early Development
Curated by ChEMBL
LigandPNGBDBM50452393(CHEMBL4212760)
Affinity DataEC50:  178nM. Assay description: Positive allosteric modulation of M1 receptor Y179A/W400A mutant (unknown origin)
Ligand InfoPC cidPC sid
In DepthDetails ArticlePubMed
TargetMuscarinic acetylcholine receptor M5(Homo sapiens (Human))
Roche Pharma Research And Early Development
Curated by ChEMBL
LigandPNGBDBM50452393(CHEMBL4212760)
Affinity DataEC50:  1.30E+3nM. Assay description: Positive allosteric modulation of M5 receptor (unknown origin)
Ligand InfoPC cidPC sid
In DepthDetails ArticlePubMed
TargetMuscarinic acetylcholine receptor M1(RAT)
Roche Pharma Research And Early Development
Curated by ChEMBL
LigandPNGBDBM50452393(CHEMBL4212760)
Affinity DataEC50:  218nM. Assay description: Positive allosteric modulation of rat M1 receptor assessed as increase in acetylcholine-induced calcium flux by FLIPR assay
Ligand InfoPC cidPC sid
In DepthDetails ArticlePubMed