BDBM50452441 CHEMBL4211235
SMILES Cc1ccc2NC(=S)CN=C(c3ccccc3)c2c1
InChI Key InChIKey=VQVPZQSSNYRPQH-UHFFFAOYSA-N
Data  1 EC50
  Tab Delimited (TSV)   2D SDfile   Computed 3D by Vconf -m prep SDfile
Find this compound or compounds like it in BindingDB:
Activity Spreadsheet -- Enzyme Inhibition Constant Data from BindingDB
Found 1 hit for monomerid = 50452441
TargetMuscarinic acetylcholine receptor M1(Homo sapiens (Human))
Roche Pharma Research And Early Development
Curated by ChEMBL
LigandPNGBDBM50452441(CHEMBL4211235)
Affinity DataEC50:  3.68E+3nM. Assay description: Positive allosteric modulation of human wild type M1 receptor assessed as increase in acetylcholine-induced calcium flux by FLIPR assay
Ligand InfoPC cidPC sid
In DepthDetails ArticlePubMed