BDBM50452584 CHEMBL4208211
SMILES Cc1ccc(cc1)C(c1c[nH]c2ccc(cc12)C(=O)NNC(=S)Nc1ccc(Cl)c(Cl)c1)c1c[nH]c2ccc(cc12)C(=O)NNC(=S)Nc1ccc(Cl)c(Cl)c1
InChI Key InChIKey=JFSZGXCQQFSGSD-UHFFFAOYSA-N
Data  1 IC50
  Tab Delimited (TSV)   2D SDfile   Computed 3D by Vconf -m prep SDfile
Find this compound or compounds like it in BindingDB:
Activity Spreadsheet -- Enzyme Inhibition Constant Data from BindingDB
Found 1 hit for monomerid = 50452584
TargetUrease(Canavalia ensiformis (Jack bean) (Horse bean))
Imam Abdulrahman Bin Faisal University
Curated by ChEMBL
LigandPNGBDBM50452584(CHEMBL4208211)
Affinity DataIC50:  140nM. Assay description: Inhibition of jack bean urease assessed as reduction in ammonia production using urea as substrate after 15 mins by indophenol method
Ligand InfoPC cidPC sid
In DepthDetails ArticlePubMed