BDBM50452678 CHEMBL4211326
SMILES Nc1cc(OC2CN(C2)C(=O)c2ccc(cc2)S(F)(=O)=O)ccn1
InChI Key InChIKey=KGUKDZKNHHDDJZ-UHFFFAOYSA-N
Data  1 KI
  Tab Delimited (TSV)   2D SDfile   Computed 3D by Vconf -m prep SDfile
Find this compound or compounds like it in BindingDB:
Activity Spreadsheet -- Enzyme Inhibition Constant Data from BindingDB
Found 1 hit for monomerid = 50452678
TargetCalmodulin-sensitive adenylate cyclase(Bacillus anthracis)
Hawaii Biotech
Curated by ChEMBL
LigandPNGBDBM50452678(CHEMBL4211326)
Affinity DataKi:  1.09E+4nM. Assay description: Inactivation of Bacillus anthracis edema factor in presence of CaM incubated for 10 to 240 mins by EnzChek pyrophosphate assay
Ligand InfoPC cidPC sid
In DepthDetails ArticlePubMed