BDBM50452690 CHEMBL4205857
SMILES Cc1nc(N)cc(OCCNC(=O)c2ccc(cc2)S(F)(=O)=O)n1
InChI Key InChIKey=DQEYWLJRFUBYFU-UHFFFAOYSA-N
Data  1 KI
  Tab Delimited (TSV)   2D SDfile   Computed 3D by Vconf -m prep SDfile
Find this compound or compounds like it in BindingDB:
Activity Spreadsheet -- Enzyme Inhibition Constant Data from BindingDB
Found 1 hit for monomerid = 50452690
TargetCalmodulin-sensitive adenylate cyclase(Bacillus anthracis)
Hawaii Biotech
Curated by ChEMBL
LigandPNGBDBM50452690(CHEMBL4205857)
Affinity DataKi:  2.86E+5nM. Assay description: Inactivation of Bacillus anthracis edema factor in presence of CaM incubated for 10 to 240 mins by EnzChek pyrophosphate assay
Ligand InfoPC cidPC sid
In DepthDetails ArticlePubMed