BDBM50452927 CHEMBL4203943
SMILES NC(=N)NCCC[C@H](NC(=O)c1sccc1NS(=O)(=O)c1cc(cc2CCOc12)-c1ccccc1Cc1cn[nH]c1)C(O)=O
InChI Key InChIKey=NANQMXDHDFNKBY-QHCPKHFHSA-N
Data  1 Kd
  Tab Delimited (TSV)   2D SDfile   Computed 3D by Vconf -m prep SDfile
Find this compound or compounds like it in BindingDB:
Activity Spreadsheet -- Enzyme Inhibition Constant Data from BindingDB
Found 1 hit for monomerid = 50452927
TargetNeuropilin-1(Homo sapiens (Human))
Nce Discovery (Domainex)
Curated by ChEMBL
LigandPNGBDBM50452927(CHEMBL4203943)
Affinity DataKd:  2.14E+3nM. Assay description: Binding affinity to N-terminal His6-tagged recombinant human NRP1-b1 domain expressed in Escherichia coli Rosetta Gami 2 (DE3) pLysS cells by SPR met...
Ligand InfoKEGGPC cidPC sid
In DepthDetails ArticlePubMed