BDBM50453008 CHEMBL4205347
SMILES NC(=N)NCCC[C@H](NC(=O)c1sccc1NS(=O)(=O)c1cc(cc2CCOc12)-c1cccc(Cc2ccccn2)c1)C(O)=O
InChI Key InChIKey=UKGCIJZVQAJGMJ-VWLOTQADSA-N
Data  1 Kd
  Tab Delimited (TSV)   2D SDfile   Computed 3D by Vconf -m prep SDfile
Find this compound or compounds like it in BindingDB:
Activity Spreadsheet -- Enzyme Inhibition Constant Data from BindingDB
Found 1 hit for monomerid = 50453008
TargetNeuropilin-1(Homo sapiens (Human))
Nce Discovery (Domainex)
Curated by ChEMBL
LigandPNGBDBM50453008(CHEMBL4205347)
Affinity DataKd:  410nM. Assay description: Binding affinity to N-terminal His6-tagged recombinant human NRP1-b1 domain expressed in Escherichia coli Rosetta Gami 2 (DE3) pLysS cells by SPR met...
Ligand InfoKEGGPC cidPC sid
In DepthDetails ArticlePubMed