BDBM50453632 CHEMBL4207319
SMILES OC(CN1C2CC2CCC1=O)Cn1c2ccc(F)cc2c2cc(F)ccc12
InChI Key InChIKey=JAHXCBDOLRBKOD-UHFFFAOYSA-N
Data  1 EC50
  Tab Delimited (TSV)   2D SDfile   Computed 3D by Vconf -m prep SDfile
Find this compound or compounds like it in BindingDB:
Activity Spreadsheet -- Enzyme Inhibition Constant Data from BindingDB
Found 1 hit for monomerid = 50453632
TargetCryptochrome-2(Homo sapiens)TBA
LigandPNGBDBM50453632(CHEMBL4207319)
Affinity DataEC50:  565nM. Assay description: Modulation activity at CRY2/PER2 in human U2OS cells harboring per2-dLuc assessed as activation of per2 activity measured every 100 mins for 5 days b...
Ligand InfoPC cidPC sid
In DepthDetails ArticlePubMed