BDBM50453798 CHEMBL4207609
SMILES COc1cc2c(cc1-c1c(C)noc1C)[nH]c1ncnc(-c3c(C)oc4ccccc34)c21
InChI Key InChIKey=VRWRLXQGMJQOAT-UHFFFAOYSA-N
Data  2 KI  2 IC50
  Tab Delimited (TSV)   2D SDfile   Computed 3D by Vconf -m prep SDfile
Find this compound or compounds like it in BindingDB:
Activity Spreadsheet -- Enzyme Inhibition Constant Data from BindingDB
Found 4 hits for monomerid = 50453798
TargetBromodomain-containing protein 4(Homo sapiens (Human))
University Of Michigan
Curated by ChEMBL
LigandPNGBDBM50453798(CHEMBL4207609)
Affinity DataKi:  2.80nM. Assay description: Inhibition of FAM-labeled ZBA248 binding to recombinant human N-terminal His6-tagged BRD4 bromodomain 1 (44 to 168 residues) expressed in Rosetta2 DE...
Ligand InfoPC cidPC sid
In DepthDetails ArticlePubMed
TargetBromodomain-containing protein 4(Homo sapiens (Human))
University Of Michigan
Curated by ChEMBL
LigandPNGBDBM50453798(CHEMBL4207609)
Affinity DataKi:  9.30nM. Assay description: Inhibition of FAM-labeled ZBA248 binding to recombinant human N-terminal His6-tagged BRD4 bromodomain 2 (333 to 460 residues) expressed in Rosetta2 D...
Ligand InfoPC cidPC sid
In DepthDetails ArticlePubMed
TargetBromodomain-containing protein 4(Homo sapiens (Human))
University Of Michigan
Curated by ChEMBL
LigandPNGBDBM50453798(CHEMBL4207609)
Affinity DataIC50:  32nM. Assay description: Inhibition of FAM-labeled ZBA248 binding to recombinant human N-terminal His6-tagged BRD4 bromodomain 2 (333 to 460 residues) expressed in Rosetta2 D...
Ligand InfoPC cidPC sid
In DepthDetails ArticlePubMed
TargetBromodomain-containing protein 4(Homo sapiens (Human))
University Of Michigan
Curated by ChEMBL
LigandPNGBDBM50453798(CHEMBL4207609)
Affinity DataIC50:  12nM. Assay description: Inhibition of FAM-labeled ZBA248 binding to recombinant human N-terminal His6-tagged BRD4 bromodomain 1 (44 to 168 residues) expressed in Rosetta2 DE...
Ligand InfoPC cidPC sid
In DepthDetails ArticlePubMed