BDBM50455925 CHEMBL267297
SMILES Cc1ccc2n(C)cc(C3=NCC4(CN5CCC4CC5)O3)c2c1
InChI Key InChIKey=UQHHJCOOARZPFR-UHFFFAOYSA-N
Data  1 IC50
  Tab Delimited (TSV)   2D SDfile   Computed 3D by Vconf -m prep SDfile
Find this compound or compounds like it in BindingDB:
Activity Spreadsheet -- Enzyme Inhibition Constant Data from BindingDB
Found 1 hit for monomerid = 50455925
Target5-hydroxytryptamine receptor 3A/3B(Rattus norvegicus)
Merck Sharp And Dohme Research Laboratories
Curated by ChEMBL
LigandPNGBDBM50455925(CHEMBL267297)
Affinity DataIC50:  132nM. Assay description: Displacement of [3H]Q-ICS-205-930 from 5-hydroxytryptamine 3 receptor recognition sites in rat brain membranes
In DepthDetails ArticlePubMed