BDBM50456297 CHEMBL2111924
SMILES CN1c2ccccc2C(=N[C@@H](NC(=O)Nc2cccc(Cl)c2)C1=O)c1ccccc1
InChI Key InChIKey=LUSQLJBVTOBLCB-NRFANRHFSA-N
Data  2 IC50
  Tab Delimited (TSV)   2D SDfile   Computed 3D by Vconf -m prep SDfile
Find this compound or compounds like it in BindingDB:
Activity Spreadsheet -- Enzyme Inhibition Constant Data from BindingDB
Found 2 hits for monomerid = 50456297
TargetGastrin/cholecystokinin type B receptor(Homo sapiens (Human))
Merck Research Laboratories
Curated by ChEMBL
LigandPNGBDBM50456297(CHEMBL2111924)
Affinity DataIC50:  7.5nM. Assay description: Inhibition of binding of [125I]-CCK-8 to the cholecystokinin type B receptor
In DepthDetails ArticlePubMed
TargetCholecystokinin receptor type A(RAT)
Merck Research Laboratories
Curated by ChEMBL
LigandPNGBDBM50456297(CHEMBL2111924)
Affinity DataIC50:  290nM. Assay description: Inhibition of binding of [125I]CCK-8 to cholecystokinin type A receptor in rat pancreatic tissue
In DepthDetails ArticlePubMed