BDBM50456352 CHEMBL4213926::US11001575, Example 104
SMILES Clc1cnc(NC2CCOCC2)nc1-c1ccc2CN(CCN3CCOCC3)C(=O)c2c1
InChI Key InChIKey=GWFKQIHFNOHJAK-UHFFFAOYSA-N
Data  3 IC50
PDB links: 1 PDB ID matches this monomer.
  Tab Delimited (TSV)   2D SDfile   Computed 3D by Vconf -m prep SDfile
Find this compound or compounds like it in BindingDB:
Activity Spreadsheet -- Enzyme Inhibition Constant Data from BindingDB
Found 3 hits for monomerid = 50456352
TargetMitogen-activated protein kinase 1(Homo sapiens (Human))
Astex Pharmaceuticals
Curated by ChEMBL
LigandPNGBDBM50456352(CHEMBL4213926 | US11001575, Example 104)
Affinity DataIC50:  21nM. Assay description: Inhibition of full length human N-terminal MAHHHHHH-tagged ERK2 expressed in Escherichia coli BL21 (DE3) using ATF2-GFP as substrate after 30 mins by...
Ligand InfoPC cidPC sidPDB
TargetMitogen-activated protein kinase 1(Homo sapiens (Human))
Astex Pharmaceuticals
Curated by ChEMBL
LigandPNGBDBM50456352(CHEMBL4213926 | US11001575, Example 104)
Affinity DataIC50:  12nM. Assay description: Activity of ERK2 enzyme (Life Technologies) was determined using a time-resolved fluorescence format measuring the phosphorylation of a truncated ver...
Ligand InfoPC cidPC sidPDB
TargetMitogen-activated protein kinase 1(Homo sapiens (Human))
Astex Pharmaceuticals
Curated by ChEMBL
LigandPNGBDBM50456352(CHEMBL4213926 | US11001575, Example 104)
Affinity DataIC50:  12nM. Assay description: Activity of ERK2 enzyme (Life Technologies) was determined using a time-resolved fluorescence format measuring the phosphorylation of a truncated ver...
Ligand InfoPC cidPC sidPDB