BDBM50456643 CHEMBL4214760
SMILES Fc1ccc(CN(CCCCOc2ccc3ccc(=O)oc3c2)CC#C)cc1F
InChI Key InChIKey=MSTPETYCFKDUBN-UHFFFAOYSA-N
Data  2 IC50
  Tab Delimited (TSV)   2D SDfile   Computed 3D by Vconf -m prep SDfile
Find this compound or compounds like it in BindingDB:
Activity Spreadsheet -- Enzyme Inhibition Constant Data from BindingDB
Found 2 hits for monomerid = 50456643
TargetAmine oxidase [flavin-containing] B(Homo sapiens (Human))
Shenyang Pharmaceutical University
Curated by ChEMBL
LigandPNGBDBM50456643(CHEMBL4214760)
Affinity DataIC50:  2.37E+3nM. Assay description: Inhibition of recombinant human MAO-B using p-tyramine as substrate preincubated for 15 mins followed by substrate addition measured after 20 mins by...
Ligand InfoPC cidPC sid
In DepthDetails ArticlePubMed
TargetAmine oxidase [flavin-containing] A(Homo sapiens (Human))
Shenyang Pharmaceutical University
Curated by ChEMBL
LigandPNGBDBM50456643(CHEMBL4214760)
Affinity DataIC50:  9.32E+4nM. Assay description: Inhibition of recombinant human MAO-A using p-tyramine as substrate preincubated for 15 mins followed by substrate addition measured after 20 mins by...
Ligand InfoPC cidPC sid
In DepthDetails ArticlePubMed