BDBM50456660 CHEMBL4216733
SMILES Fc1cccc(CN(CCCOc2ccc3ccc(=O)oc3c2)CC#C)c1
InChI Key InChIKey=CXVKTQZYCHOJIJ-UHFFFAOYSA-N
Data  2 IC50
  Tab Delimited (TSV)   2D SDfile   Computed 3D by Vconf -m prep SDfile
Find this compound or compounds like it in BindingDB:
Activity Spreadsheet -- Enzyme Inhibition Constant Data from BindingDB
Found 2 hits for monomerid = 50456660
TargetAmine oxidase [flavin-containing] A(Homo sapiens (Human))
Shenyang Pharmaceutical University
Curated by ChEMBL
LigandPNGBDBM50456660(CHEMBL4216733)
Affinity DataIC50:  2.93E+4nM. Assay description: Inhibition of recombinant human MAO-A using p-tyramine as substrate preincubated for 15 mins followed by substrate addition measured after 20 mins by...
Ligand InfoPC cidPC sid
In DepthDetails ArticlePubMed
TargetAmine oxidase [flavin-containing] B(Homo sapiens (Human))
Shenyang Pharmaceutical University
Curated by ChEMBL
LigandPNGBDBM50456660(CHEMBL4216733)
Affinity DataIC50:  4.44E+3nM. Assay description: Inhibition of recombinant human MAO-B using p-tyramine as substrate preincubated for 15 mins followed by substrate addition measured after 20 mins by...
Ligand InfoPC cidPC sid
In DepthDetails ArticlePubMed