BDBM50456982 CHEMBL4208517
SMILES Cc1[nH]c(C(=O)NC\C=C\c2c[nH]c(N)n2)c(Br)c1Br
InChI Key InChIKey=XRTRMGKJUIMSKZ-NSCUHMNNSA-N
Data  9 IC50
  Tab Delimited (TSV)   2D SDfile   Computed 3D by Vconf -m prep SDfile
Find this compound or compounds like it in BindingDB:
Activity Spreadsheet -- Enzyme Inhibition Constant Data from BindingDB
Found 9 hits for monomerid = 50456982
TargetPotassium voltage-gated channel subfamily A member 4(Homo sapiens (Human))
University Of Ljubljana
Curated by ChEMBL
LigandPNGBDBM50456982(CHEMBL4208517)
Affinity DataIC50:  1.20E+4nM. Assay description: Inhibition of human Kv1.4 expressed in CHO cells at -80 mV holding potential by whole cell automated patch clamp method
Ligand InfoPC cidPC sid
In DepthDetails ArticlePubMed
TargetPotassium voltage-gated channel subfamily A member 5(Homo sapiens (Human))
University Of Ljubljana
Curated by ChEMBL
LigandPNGBDBM50456982(CHEMBL4208517)
Affinity DataIC50: >3.00E+4nM. Assay description: Inhibition of human Kv1.5 expressed in CHO cells at -80 mV holding potential by whole cell automated patch clamp method
Ligand InfoPC cidPC sid
In DepthDetails ArticlePubMed
TargetPotassium voltage-gated channel subfamily A member 6(Homo sapiens (Human))
University Of Ljubljana
Curated by ChEMBL
LigandPNGBDBM50456982(CHEMBL4208517)
Affinity DataIC50:  2.90E+4nM. Assay description: Inhibition of human Kv1.6 expressed in CHO cells at -80 mV holding potential by whole cell automated patch clamp method
Ligand InfoPC cidPC sid
In DepthDetails ArticlePubMed
TargetPotassium voltage-gated channel subfamily A member 4(Rattus norvegicus)
University Of Ljubljana
Curated by ChEMBL
LigandPNGBDBM50456982(CHEMBL4208517)
Affinity DataIC50:  230nM. Assay description: Inhibition of rat Kv1.4 expressed in Xenopus laevis oocytes at -90 mV holding potential by two-electrode voltage clamp assay
Ligand InfoPC cidPC sid
In DepthDetails ArticlePubMed
TargetPotassium voltage-gated channel subfamily A member 3(Rattus norvegicus)
University Of Ljubljana
Curated by ChEMBL
LigandPNGBDBM50456982(CHEMBL4208517)
Affinity DataIC50: >1.00E+4nM. Assay description: Inhibition of rat Kv1.3 expressed in Xenopus laevis oocytes at -90 mV holding potential by two-electrode voltage clamp assay
Ligand InfoPC cidPC sid
In DepthDetails ArticlePubMed
TargetPotassium voltage-gated channel subfamily A member 1(Homo sapiens (Human))
University Of Ljubljana
Curated by ChEMBL
LigandPNGBDBM50456982(CHEMBL4208517)
Affinity DataIC50: >3.00E+4nM. Assay description: Inhibition of human Kv1.1 expressed in CHO cells at -80 mV holding potential by whole cell automated patch clamp method
Ligand InfoPC cidPC sid
In DepthDetails ArticlePubMed
TargetPotassium voltage-gated channel subfamily A member 3(Homo sapiens (Human))
University Of Ljubljana
Curated by ChEMBL
LigandPNGBDBM50456982(CHEMBL4208517)
Affinity DataIC50:  1.70E+4nM. Assay description: Inhibition of human Kv1.3 expressed in CHO cells at -80 mV holding potential by whole cell automated patch clamp method
Ligand InfoPC cidPC sid
In DepthDetails ArticlePubMed
TargetPotassium voltage-gated channel subfamily A member 2(Homo sapiens (Human))
University Of Ljubljana
Curated by ChEMBL
LigandPNGBDBM50456982(CHEMBL4208517)
Affinity DataIC50: >3.00E+4nM. Assay description: Inhibition of human Kv1.2 expressed in CHO cells at -80 mV holding potential by whole cell automated patch clamp method
Ligand InfoPC cidPC sid
In DepthDetails ArticlePubMed
TargetPotassium voltage-gated channel subfamily A member 6(Rattus norvegicus)
University Of Ljubljana
Curated by ChEMBL
LigandPNGBDBM50456982(CHEMBL4208517)
Affinity DataIC50: >1.00E+4nM. Assay description: Inhibition of rat Kv1.6 expressed in Xenopus laevis oocytes at -90 mV holding potential by two-electrode voltage clamp assay
Ligand InfoPC cidPC sid
In DepthDetails ArticlePubMed