BDBM50457687 CHEMBL4205471
SMILES CS(=O)(=O)c1ccc(N2CCC(F)(F)CC2)c(c1)C(=O)N1Cc2cn(nc2C1)-c1ccccc1F
InChI Key InChIKey=RROASANFHJCPDA-UHFFFAOYSA-N
Data  10 IC50
  Tab Delimited (TSV)   2D SDfile   Computed 3D by Vconf -m prep SDfile
Find this compound or compounds like it in BindingDB:
Activity Spreadsheet -- Enzyme Inhibition Constant Data from BindingDB
Found 10 hits for monomerid = 50457687
TargetCytochrome P450 1A2(Homo sapiens (Human))
Dart Neuroscience
Curated by ChEMBL
LigandPNGBDBM50457687(CHEMBL4205471)
Affinity DataIC50: >1.00E+4nM. Assay description: Inhibition of CYP1A2 in human liver microsomes using phenacetin as substrate measured after 10 mins in presence of NADPH by LC-MS/MS analysis
Ligand InfoPC cidPC sid
In DepthDetails ArticlePubMed
TargetSodium- and chloride-dependent glycine transporter 1(Homo sapiens (Human))
Dart Neuroscience
Curated by ChEMBL
LigandPNGBDBM50457687(CHEMBL4205471)
Affinity DataIC50:  16nM. Assay description: Inhibition of recombinant human GlyT1c expressed in HEK293 cells assessed as reduction in [14C]glycine uptake after 2 hrs by microbeta scintillation ...
Ligand InfoPC cidPC sid
In DepthDetails ArticlePubMed
TargetPotassium voltage-gated channel subfamily H member 2(Homo sapiens (Human))
Dart Neuroscience
Curated by ChEMBL
LigandPNGBDBM50457687(CHEMBL4205471)
Affinity DataIC50:  4.30E+3nM. Assay description: Inhibition of human ERG expressed in CHO cells at 10 nM to 10 uM at holding potential of -80 mV measured after 5 mins by QPatch automated patch clamp...
Ligand InfoPC cidPC sid
In DepthDetails ArticlePubMed
TargetSodium- and chloride-dependent glycine transporter 1(attus norvegicus (Rat))
Dart Neuroscience
Curated by ChEMBL
LigandPNGBDBM50457687(CHEMBL4205471)
Affinity DataIC50:  12nM. Assay description: Inhibition of GlyT1 in primary rat cortical neurons assessed as reduction in [14C]glycine uptake after 2 hrs by microbeta scintillation counting meth...
Ligand InfoPC cidPC sid
In DepthDetails ArticlePubMed
TargetCytochrome P450 2D6(Homo sapiens (Human))
Dart Neuroscience
Curated by ChEMBL
LigandPNGBDBM50457687(CHEMBL4205471)
Affinity DataIC50: >1.00E+4nM. Assay description: Inhibition of CYP2D6 in human liver microsomes using dextromethorphan as substrate measured after 10 mins in presence of NADPH by LC-MS/MS analysis
Ligand InfoPC cidPC sid
In DepthDetails ArticlePubMed
TargetCytochrome P450 2C9(Homo sapiens (Human))
Dart Neuroscience
Curated by ChEMBL
LigandPNGBDBM50457687(CHEMBL4205471)
Affinity DataIC50: >1.00E+4nM. Assay description: Inhibition of CYP2C9 in human liver microsomes using diclofenac as substrate measured after 10 mins in presence of NADPH by LC-MS/MS analysis
Ligand InfoPC cidPC sid
In DepthDetails ArticlePubMed
TargetCytochrome P450 2C19(Homo sapiens (Human))
Dart Neuroscience
Curated by ChEMBL
LigandPNGBDBM50457687(CHEMBL4205471)
Affinity DataIC50: >1.00E+4nM. Assay description: Inhibition of CYP2C19 in human liver microsomes using S-mephenytoin as substrate measured after 10 mins in presence of NADPH by LC-MS/MS analysis
Ligand InfoPC cidPC sid
In DepthDetails ArticlePubMed
TargetCytochrome P450 3A5(Homo sapiens (Human))
Dart Neuroscience
Curated by ChEMBL
LigandPNGBDBM50457687(CHEMBL4205471)
Affinity DataIC50: >1.00E+4nM. Assay description: Inhibition of CYP3A5 in human liver microsomes using midazolam as substrate measured after 10 mins in presence of NADPH by LC-MS/MS analysis
Ligand InfoPC cidPC sid
In DepthDetails ArticlePubMed
TargetCytochrome P450 3A4(Homo sapiens (Human))
Dart Neuroscience
Curated by ChEMBL
LigandPNGBDBM50457687(CHEMBL4205471)
Affinity DataIC50: >1.00E+4nM. Assay description: Inhibition of CYP3A4 in human liver microsomes using midazolam as substrate measured after 7 mins in presence of NADPH by LC-MS/MS analysis
Ligand InfoPC cidPC sid
In DepthDetails ArticlePubMed
TargetSodium- and chloride-dependent glycine transporter 2(Homo sapiens (Human))
Dart Neuroscience
Curated by ChEMBL
LigandPNGBDBM50457687(CHEMBL4205471)
Affinity DataIC50: >1.00E+4nM. Assay description: Inhibition of recombinant human GlyT2 expressed in HEK293 cells assessed as reduction in [14C]glycine uptake after 2 hrs by microbeta scintillation c...
Ligand InfoPC cidPC sid
In DepthDetails ArticlePubMed