BDBM50457753 CHEMBL4215862
SMILES COc1cc2c(NC3CCN(C)CC3)cc(nc2cc1OC1CC2(C1)CN(C2)C(C)C)-c1ccc(C)o1
InChI Key InChIKey=SJSJYFGBZRKJLV-UHFFFAOYSA-N
Data  2 IC50
  Tab Delimited (TSV)   2D SDfile   Computed 3D by Vconf -m prep SDfile
Find this compound or compounds like it in BindingDB:
Activity Spreadsheet -- Enzyme Inhibition Constant Data from BindingDB
Found 2 hits for monomerid = 50457753
TargetHistone-lysine N-methyltransferase EHMT2(Homo sapiens (Human))
Wuxi Apptec (Tianjin) Co.
Curated by ChEMBL
LigandPNGBDBM50457753(CHEMBL4215862)
Affinity DataIC50:  378nM. Assay description: Inhibition of human G9a using biotinylated-H3K9 peptide as substrate after 1 hr in presence of SAM by TR-FRET assay
Ligand InfoPC cidPC sid
In DepthDetails ArticlePubMed
TargetDNA (cytosine-5)-methyltransferase 1(Homo sapiens (Human))
Wuxi Apptec (Tianjin) Co.
Curated by ChEMBL
LigandPNGBDBM50457753(CHEMBL4215862)
Affinity DataIC50:  83nM. Assay description: Inhibition of human DNMT1 using polydeoxyinosine polydeoxycytosine DNA as substrate after 15 mins in presence of SAM by TR-FRET assay
Ligand InfoPC cidPC sid
In DepthDetails ArticlePubMed