BDBM50457756 CHEMBL4203647
SMILES COc1cc2c(NCC3CCN(CC3)C(C)C)cc(nc2cc1OCCCN1CCCC1)-c1ccc(C)o1
InChI Key InChIKey=ZAWYCUBKBPHGBY-UHFFFAOYSA-N
Data  2 IC50
  Tab Delimited (TSV)   2D SDfile   Computed 3D by Vconf -m prep SDfile
Find this compound or compounds like it in BindingDB:
Activity Spreadsheet -- Enzyme Inhibition Constant Data from BindingDB
Found 2 hits for monomerid = 50457756
TargetDNA (cytosine-5)-methyltransferase 1(Homo sapiens (Human))
Wuxi Apptec (Tianjin) Co.
Curated by ChEMBL
LigandPNGBDBM50457756(CHEMBL4203647)
Affinity DataIC50:  205nM. Assay description: Inhibition of human DNMT1 using polydeoxyinosine polydeoxycytosine DNA as substrate after 15 mins in presence of SAM by TR-FRET assay
Ligand InfoPC cidPC sid
In DepthDetails ArticlePubMed
TargetHistone-lysine N-methyltransferase EHMT2(Homo sapiens (Human))
Wuxi Apptec (Tianjin) Co.
Curated by ChEMBL
LigandPNGBDBM50457756(CHEMBL4203647)
Affinity DataIC50:  13nM. Assay description: Inhibition of human G9a using biotinylated-H3K9 peptide as substrate after 1 hr in presence of SAM by TR-FRET assay
Ligand InfoPC cidPC sid
In DepthDetails ArticlePubMed